{"text_format":"1","workbook":"xlsx","n_sheets":4,"sheets":["CAP","VTT","Inscrip","Feuil1"],"not_rendered":{"charts":0,"images":0,"macros":0,"external_links":0,"defined_names":0,"comments":0,"pivot_tables":0},"unopened":[],"bounds":{"document_bytes":16777216,"sheet_cells":100000,"rows_first":2000,"rows_last":500,"rows_between":2000,"halvings":0,"cell_chars":16384,"cell_head_chars":4096},"cells_cut":0,"cells_raw":0,"read":"whole","date_system":"1900"}

{"sheet":"CAP","index":0,"n_rows":33,"n_cols":7,"rows_kept":33,"cut":false,"hidden":false,"merged":[]}
[null,"         CAP",null,"JEUNES 1"]
[]
["Nom","Prénom","Cat","Club","Plaque","Temps","Classement"]
[{"$f":"VLOOKUP($E4,Inscrip!$A$2:$I$88,2)","v":"Besalduch"},{"$f":"VLOOKUP($E4,Inscrip!$A$2:$I$88,3)","v":"Baptiste"},{"$f":"VLOOKUP($E4,Inscrip!$A$2:$I$88,4)","v":"PuG"},{"$f":"VLOOKUP($E4,Inscrip!$A$2:$I$88,5)","v":"BCAM(NL)"},717,3.03,1]
[{"$f":"VLOOKUP($E5,Inscrip!$A$2:$I$88,2)","v":"FEBRER "},{"$f":"VLOOKUP($E5,Inscrip!$A$2:$I$88,3)","v":"Vincent"},{"$f":"VLOOKUP($E5,Inscrip!$A$2:$I$88,4)","v":"PG"},{"$f":"VLOOKUP($E5,Inscrip!$A$2:$I$88,5)","v":"GNT"},730,3.31,2]
[{"$f":"VLOOKUP($E6,Inscrip!$A$2:$I$88,2)","v":"Blot"},{"$f":"VLOOKUP($E6,Inscrip!$A$2:$I$88,3)","v":"Titouan"},{"$f":"VLOOKUP($E6,Inscrip!$A$2:$I$88,4)","v":"PuG"},{"$f":"VLOOKUP($E6,Inscrip!$A$2:$I$88,5)","v":"NL"},711,3.32,3]
[{"$f":"VLOOKUP($E7,Inscrip!$A$2:$I$88,2)","v":"Rue"},{"$f":"VLOOKUP($E7,Inscrip!$A$2:$I$88,3)","v":"Tom"},{"$f":"VLOOKUP($E7,Inscrip!$A$2:$I$88,4)","v":"PuG"},{"$f":"VLOOKUP($E7,Inscrip!$A$2:$I$88,5)","v":"NL"},713,3.33,4]
[{"$f":"VLOOKUP($E8,Inscrip!$A$2:$I$88,2)","v":"Rue"},{"$f":"VLOOKUP($E8,Inscrip!$A$2:$I$88,3)","v":"Loan"},{"$f":"VLOOKUP($E8,Inscrip!$A$2:$I$88,4)","v":"MPG"},{"$f":"VLOOKUP($E8,Inscrip!$A$2:$I$88,5)","v":"NL"},714,3.33,5]
[{"$f":"VLOOKUP($E9,Inscrip!$A$2:$I$88,2)","v":"Martinez"},{"$f":"VLOOKUP($E9,Inscrip!$A$2:$I$88,3)","v":"Margaux"},{"$f":"VLOOKUP($E9,Inscrip!$A$2:$I$88,4)","v":"PF"},{"$f":"VLOOKUP($E9,Inscrip!$A$2:$I$88,5)","v":"BCAM"},722,3.4,6]
[{"$f":"VLOOKUP($E10,Inscrip!$A$2:$I$88,2)","v":"Egiziano"},{"$f":"VLOOKUP($E10,Inscrip!$A$2:$I$88,3)","v":"Loane"},{"$f":"VLOOKUP($E10,Inscrip!$A$2:$I$88,4)","v":"PuF"},{"$f":"VLOOKUP($E10,Inscrip!$A$2:$I$88,5)","v":"Loupian tri Nature"},704,3.44,7]
[{"$f":"VLOOKUP($E11,Inscrip!$A$2:$I$88,2)","v":"Bauby"},{"$f":"VLOOKUP($E11,Inscrip!$A$2:$I$88,3)","v":"Thomas"},{"$f":"VLOOKUP($E11,Inscrip!$A$2:$I$88,4)","v":"PuG"},{"$f":"VLOOKUP($E11,Inscrip!$A$2:$I$88,5)","v":"Loupian tri Nature (NL)"},701,3.51,8]
[{"$f":"VLOOKUP($E12,Inscrip!$A$2:$I$88,2)","v":"PAUL "},{"$f":"VLOOKUP($E12,Inscrip!$A$2:$I$88,3)","v":"Ronan"},{"$f":"VLOOKUP($E12,Inscrip!$A$2:$I$88,4)","v":"PG"},{"$f":"VLOOKUP($E12,Inscrip!$A$2:$I$88,5)","v":0},727,4.0199999999999996,9]
[{"$f":"VLOOKUP($E13,Inscrip!$A$2:$I$88,2)","v":"FAJARDO"},{"$f":"VLOOKUP($E13,Inscrip!$A$2:$I$88,3)","v":"Lucas"},{"$f":"VLOOKUP($E13,Inscrip!$A$2:$I$88,4)","v":"PG"},{"$f":"VLOOKUP($E13,Inscrip!$A$2:$I$88,5)","v":"VTThau"},723,4.0199999999999996,10]
[{"$f":"VLOOKUP($E14,Inscrip!$A$2:$I$88,2)","v":"MOURGUES "},{"$f":"VLOOKUP($E14,Inscrip!$A$2:$I$88,3)","v":"Pierre"},{"$f":"VLOOKUP($E14,Inscrip!$A$2:$I$88,4)","v":"PG"},{"$f":"VLOOKUP($E14,Inscrip!$A$2:$I$88,5)","v":0},728,4.03,11]
[{"$f":"VLOOKUP($E15,Inscrip!$A$2:$I$88,2)","v":"Weislo"},{"$f":"VLOOKUP($E15,Inscrip!$A$2:$I$88,3)","v":"Yoan"},{"$f":"VLOOKUP($E15,Inscrip!$A$2:$I$88,4)","v":"MPG"},{"$f":"VLOOKUP($E15,Inscrip!$A$2:$I$88,5)","v":"NL"},712,4.07,12]
[{"$f":"VLOOKUP($E16,Inscrip!$A$2:$I$88,2)","v":"Fonta"},{"$f":"VLOOKUP($E16,Inscrip!$A$2:$I$88,3)","v":"Pauline"},{"$f":"VLOOKUP($E16,Inscrip!$A$2:$I$88,4)","v":"PuF"},{"$f":"VLOOKUP($E16,Inscrip!$A$2:$I$88,5)","v":"Loupian tri Nature"},705,4.08,13]
[{"$f":"VLOOKUP($E17,Inscrip!$A$2:$I$88,2)","v":"GUERIN"},{"$f":"VLOOKUP($E17,Inscrip!$A$2:$I$88,3)","v":"Leni"},{"$f":"VLOOKUP($E17,Inscrip!$A$2:$I$88,4)","v":"PG"},{"$f":"VLOOKUP($E17,Inscrip!$A$2:$I$88,5)","v":0},725,4.0999999999999996,14]
[{"$f":"VLOOKUP($E18,Inscrip!$A$2:$I$88,2)","v":"Chabert"},{"$f":"VLOOKUP($E18,Inscrip!$A$2:$I$88,3)","v":"Claire"},{"$f":"VLOOKUP($E18,Inscrip!$A$2:$I$88,4)","v":"PuF"},{"$f":"VLOOKUP($E18,Inscrip!$A$2:$I$88,5)","v":"BCAM (NL)"},715,4.2,15]
[{"$f":"VLOOKUP($E19,Inscrip!$A$2:$I$88,2)","v":"REGNIER"},{"$f":"VLOOKUP($E19,Inscrip!$A$2:$I$88,3)","v":"Leo"},{"$f":"VLOOKUP($E19,Inscrip!$A$2:$I$88,4)","v":"MG"},{"$f":"VLOOKUP($E19,Inscrip!$A$2:$I$88,5)","v":0},729,4.2300000000000004,16]
[{"$f":"VLOOKUP($E20,Inscrip!$A$2:$I$88,2)","v":"Arcella "},{"$f":"VLOOKUP($E20,Inscrip!$A$2:$I$88,3)","v":"Pierre"},{"$f":"VLOOKUP($E20,Inscrip!$A$2:$I$88,4)","v":"MPG"},{"$f":"VLOOKUP($E20,Inscrip!$A$2:$I$88,5)","v":"Loupian tri Nature"},700,4.24,17]
[{"$f":"VLOOKUP($E21,Inscrip!$A$2:$I$88,2)","v":"GUERIN"},{"$f":"VLOOKUP($E21,Inscrip!$A$2:$I$88,3)","v":"Lia"},{"$f":"VLOOKUP($E21,Inscrip!$A$2:$I$88,4)","v":"PF"},{"$f":"VLOOKUP($E21,Inscrip!$A$2:$I$88,5)","v":0},724,4.25,18]
[{"$f":"VLOOKUP($E22,Inscrip!$A$2:$I$88,2)","v":"Bernard"},{"$f":"VLOOKUP($E22,Inscrip!$A$2:$I$88,3)","v":"Ilian"},{"$f":"VLOOKUP($E22,Inscrip!$A$2:$I$88,4)","v":"PG"},{"$f":"VLOOKUP($E22,Inscrip!$A$2:$I$88,5)","v":"NL"},710,4.29,19]
[{"$f":"VLOOKUP($E23,Inscrip!$A$2:$I$88,2)","v":"COUTURIER "},{"$f":"VLOOKUP($E23,Inscrip!$A$2:$I$88,3)","v":"Esteban"},{"$f":"VLOOKUP($E23,Inscrip!$A$2:$I$88,4)","v":"PG"},{"$f":"VLOOKUP($E23,Inscrip!$A$2:$I$88,5)","v":0},702,4.3,20]
[{"$f":"VLOOKUP($E24,Inscrip!$A$2:$I$88,2)","v":"REGNIER"},{"$f":"VLOOKUP($E24,Inscrip!$A$2:$I$88,3)","v":"Leo"},{"$f":"VLOOKUP($E24,Inscrip!$A$2:$I$88,4)","v":"MG"},{"$f":"VLOOKUP($E24,Inscrip!$A$2:$I$88,5)","v":0},729,4.3099999999999996,21]
[{"$f":"VLOOKUP($E25,Inscrip!$A$2:$I$88,2)","v":"Moulin"},{"$f":"VLOOKUP($E25,Inscrip!$A$2:$I$88,3)","v":"Martial"},{"$f":"VLOOKUP($E25,Inscrip!$A$2:$I$88,4)","v":"MPG"},{"$f":"VLOOKUP($E25,Inscrip!$A$2:$I$88,5)","v":"NL"},706,4.32,22]
[{"$f":"VLOOKUP($E26,Inscrip!$A$2:$I$88,2)","v":"Brieu"},{"$f":"VLOOKUP($E26,Inscrip!$A$2:$I$88,3)","v":"Nino"},{"$f":"VLOOKUP($E26,Inscrip!$A$2:$I$88,4)","v":"MPG"},{"$f":"VLOOKUP($E26,Inscrip!$A$2:$I$88,5)","v":"Loupian tri Nature (NL)"},718,4.33,23]
[{"$f":"VLOOKUP($E27,Inscrip!$A$2:$I$88,2)","v":"ANDREO"},{"$f":"VLOOKUP($E27,Inscrip!$A$2:$I$88,3)","v":"Joris"},{"$f":"VLOOKUP($E27,Inscrip!$A$2:$I$88,4)","v":"MPG"},{"$f":"VLOOKUP($E27,Inscrip!$A$2:$I$88,5)","v":"Mèze"},726,4.4800000000000004,24]
[{"$f":"VLOOKUP($E28,Inscrip!$A$2:$I$88,2)","v":"Salamé"},{"$f":"VLOOKUP($E28,Inscrip!$A$2:$I$88,3)","v":"Teva"},{"$f":"VLOOKUP($E28,Inscrip!$A$2:$I$88,4)","v":"MPG"},{"$f":"VLOOKUP($E28,Inscrip!$A$2:$I$88,5)","v":"NL"},719,4.59,25]
[{"$f":"VLOOKUP($E29,Inscrip!$A$2:$I$88,2)","v":"Courbard"},{"$f":"VLOOKUP($E29,Inscrip!$A$2:$I$88,3)","v":"Anna"},{"$f":"VLOOKUP($E29,Inscrip!$A$2:$I$88,4)","v":"PuF"},{"$f":"VLOOKUP($E29,Inscrip!$A$2:$I$88,5)","v":"Loupian tri Nature"},703,5.0599999999999996,26]
[{"$f":"VLOOKUP($E30,Inscrip!$A$2:$I$88,2)","v":"Ribeiro-Patrao"},{"$f":"VLOOKUP($E30,Inscrip!$A$2:$I$88,3)","v":"Anthony"},{"$f":"VLOOKUP($E30,Inscrip!$A$2:$I$88,4)","v":"PuG"},{"$f":"VLOOKUP($E30,Inscrip!$A$2:$I$88,5)","v":"Loupian tri Nature"},708,5.08,27]
[{"$f":"VLOOKUP($E31,Inscrip!$A$2:$I$88,2)","v":"DUPIN"},{"$f":"VLOOKUP($E31,Inscrip!$A$2:$I$88,3)","v":" Noah"},{"$f":"VLOOKUP($E31,Inscrip!$A$2:$I$88,4)","v":"PG"},{"$f":"VLOOKUP($E31,Inscrip!$A$2:$I$88,5)","v":"NL"},720,5.1100000000000003,28]
[{"$f":"VLOOKUP($E32,Inscrip!$A$2:$I$88,2)","v":"Martinez"},{"$f":"VLOOKUP($E32,Inscrip!$A$2:$I$88,3)","v":"Lucie"},{"$f":"VLOOKUP($E32,Inscrip!$A$2:$I$88,4)","v":"PuF"},{"$f":"VLOOKUP($E32,Inscrip!$A$2:$I$88,5)","v":"Loupian tri Nature"},707,5.34,29]
[{"$f":"VLOOKUP($E33,Inscrip!$A$2:$I$88,2)","v":{"$error":"#N/A"}},{"$f":"VLOOKUP($E33,Inscrip!$A$2:$I$88,3)","v":{"$error":"#N/A"}},{"$f":"VLOOKUP($E33,Inscrip!$A$2:$I$88,4)","v":{"$error":"#N/A"}},{"$f":"VLOOKUP($E33,Inscrip!$A$2:$I$88,5)","v":{"$error":"#N/A"}},null,5.52,30]

{"sheet":"VTT","index":1,"n_rows":33,"n_cols":7,"rows_kept":33,"cut":false,"hidden":false,"merged":[]}
[null,"         VTT",null,"JEUNE 1"]
[]
["Nom","Prénom","Cat","Club","Plaque","Temps","Classement"]
[{"$f":"VLOOKUP($E4,Inscrip!$A$2:$I$88,2)","v":"Besalduch"},{"$f":"VLOOKUP($E4,Inscrip!$A$2:$I$88,3)","v":"Baptiste"},{"$f":"VLOOKUP($E4,Inscrip!$A$2:$I$88,4)","v":"PuG"},{"$f":"VLOOKUP($E4,Inscrip!$A$2:$I$88,5)","v":"BCAM(NL)"},717,9.52,1]
[{"$f":"VLOOKUP($E5,Inscrip!$A$2:$I$88,2)","v":"Rue"},{"$f":"VLOOKUP($E5,Inscrip!$A$2:$I$88,3)","v":"Loan"},{"$f":"VLOOKUP($E5,Inscrip!$A$2:$I$88,4)","v":"MPG"},{"$f":"VLOOKUP($E5,Inscrip!$A$2:$I$88,5)","v":"NL"},714,10.32,2]
[{"$f":"VLOOKUP($E6,Inscrip!$A$2:$I$88,2)","v":"Bauby"},{"$f":"VLOOKUP($E6,Inscrip!$A$2:$I$88,3)","v":"Thomas"},{"$f":"#N/A","v":{"$error":"#N/A"}},{"$f":"VLOOKUP($E6,Inscrip!$A$2:$I$88,5)","v":"Loupian tri Nature (NL)"},701,10.35,3]
[{"$f":"VLOOKUP($E7,Inscrip!$A$2:$I$88,2)","v":"Rue"},{"$f":"VLOOKUP($E7,Inscrip!$A$2:$I$88,3)","v":"Tom"},{"$f":"VLOOKUP($E7,Inscrip!$A$2:$I$88,4)","v":"PuG"},{"$f":"VLOOKUP($E7,Inscrip!$A$2:$I$88,5)","v":"NL"},713,10.4,4]
[{"$f":"VLOOKUP($E8,Inscrip!$A$2:$I$88,2)","v":"Blot"},{"$f":"VLOOKUP($E8,Inscrip!$A$2:$I$88,3)","v":"Titouan"},{"$f":"VLOOKUP($E8,Inscrip!$A$2:$I$88,4)","v":"PuG"},{"$f":"VLOOKUP($E8,Inscrip!$A$2:$I$88,5)","v":"NL"},711,10.58,5]
[{"$f":"VLOOKUP($E9,Inscrip!$A$2:$I$88,2)","v":"FEBRER "},{"$f":"VLOOKUP($E9,Inscrip!$A$2:$I$88,3)","v":"Vincent"},{"$f":"VLOOKUP($E9,Inscrip!$A$2:$I$88,4)","v":"PG"},{"$f":"VLOOKUP($E9,Inscrip!$A$2:$I$88,5)","v":"GNT"},730,11.02,6]
[{"$f":"VLOOKUP($E10,Inscrip!$A$2:$I$88,2)","v":"PAUL "},{"$f":"VLOOKUP($E10,Inscrip!$A$2:$I$88,3)","v":"Ronan"},{"$f":"VLOOKUP($E10,Inscrip!$A$2:$I$88,4)","v":"PG"},{"$f":"VLOOKUP($E10,Inscrip!$A$2:$I$88,5)","v":0},727,12.13,7]
[{"$f":"VLOOKUP($E11,Inscrip!$A$2:$I$88,2)","v":"FAJARDO"},{"$f":"VLOOKUP($E11,Inscrip!$A$2:$I$88,3)","v":"Lucas"},{"$f":"VLOOKUP($E11,Inscrip!$A$2:$I$88,4)","v":"PG"},{"$f":"VLOOKUP($E11,Inscrip!$A$2:$I$88,5)","v":"VTThau"},723,12.19,8]
[{"$f":"VLOOKUP($E12,Inscrip!$A$2:$I$88,2)","v":"Martinez"},{"$f":"VLOOKUP($E12,Inscrip!$A$2:$I$88,3)","v":"Margaux"},{"$f":"VLOOKUP($E12,Inscrip!$A$2:$I$88,4)","v":"PF"},{"$f":"VLOOKUP($E12,Inscrip!$A$2:$I$88,5)","v":"BCAM"},722,12.4,9]
[{"$f":"VLOOKUP($E13,Inscrip!$A$2:$I$88,2)","v":"Egiziano"},{"$f":"VLOOKUP($E13,Inscrip!$A$2:$I$88,3)","v":"Loane"},{"$f":"VLOOKUP($E13,Inscrip!$A$2:$I$88,4)","v":"PuF"},{"$f":"VLOOKUP($E13,Inscrip!$A$2:$I$88,5)","v":"Loupian tri Nature"},704,12.43,10]
[{"$f":"VLOOKUP($E14,Inscrip!$A$2:$I$88,2)","v":"REGNIER"},{"$f":"VLOOKUP($E14,Inscrip!$A$2:$I$88,3)","v":"Leo"},{"$f":"VLOOKUP($E14,Inscrip!$A$2:$I$88,4)","v":"MG"},{"$f":"VLOOKUP($E14,Inscrip!$A$2:$I$88,5)","v":0},729,12.52,11]
[{"$f":"VLOOKUP($E15,Inscrip!$A$2:$I$88,2)","v":"MOURGUES "},{"$f":"VLOOKUP($E15,Inscrip!$A$2:$I$88,3)","v":"Pierre"},{"$f":"VLOOKUP($E15,Inscrip!$A$2:$I$88,4)","v":"PG"},{"$f":"VLOOKUP($E15,Inscrip!$A$2:$I$88,5)","v":0},728,12.55,12]
[{"$f":"VLOOKUP($E16,Inscrip!$A$2:$I$88,2)","v":"Chabert"},{"$f":"VLOOKUP($E16,Inscrip!$A$2:$I$88,3)","v":"Claire"},{"$f":"VLOOKUP($E16,Inscrip!$A$2:$I$88,4)","v":"PuF"},{"$f":"VLOOKUP($E16,Inscrip!$A$2:$I$88,5)","v":"BCAM (NL)"},715,13.13,13]
[{"$f":"VLOOKUP($E17,Inscrip!$A$2:$I$88,2)","v":"Ribeiro-Patrao"},{"$f":"VLOOKUP($E17,Inscrip!$A$2:$I$88,3)","v":"Anthony"},{"$f":"VLOOKUP($E17,Inscrip!$A$2:$I$88,4)","v":"PuG"},{"$f":"VLOOKUP($E17,Inscrip!$A$2:$I$88,5)","v":"Loupian tri Nature"},708,13.16,14]
[{"$f":"VLOOKUP($E18,Inscrip!$A$2:$I$88,2)","v":"Fonta"},{"$f":"VLOOKUP($E18,Inscrip!$A$2:$I$88,3)","v":"Pauline"},{"$f":"VLOOKUP($E18,Inscrip!$A$2:$I$88,4)","v":"PuF"},{"$f":"VLOOKUP($E18,Inscrip!$A$2:$I$88,5)","v":"Loupian tri Nature"},705,13.18,15]
[{"$f":"VLOOKUP($E19,Inscrip!$A$2:$I$88,2)","v":"Arcella "},{"$f":"VLOOKUP($E19,Inscrip!$A$2:$I$88,3)","v":"Pierre"},{"$f":"VLOOKUP($E19,Inscrip!$A$2:$I$88,4)","v":"MPG"},{"$f":"VLOOKUP($E19,Inscrip!$A$2:$I$88,5)","v":"Loupian tri Nature"},700,13.59,16]
[{"$f":"VLOOKUP($E20,Inscrip!$A$2:$I$88,2)","v":"Moulin"},{"$f":"VLOOKUP($E20,Inscrip!$A$2:$I$88,3)","v":"Martial"},{"$f":"VLOOKUP($E20,Inscrip!$A$2:$I$88,4)","v":"MPG"},{"$f":"VLOOKUP($E20,Inscrip!$A$2:$I$88,5)","v":"NL"},706,15.15,17]
[{"$f":"VLOOKUP($E21,Inscrip!$A$2:$I$88,2)","v":"Brieu"},{"$f":"VLOOKUP($E21,Inscrip!$A$2:$I$88,3)","v":"Nino"},{"$f":"VLOOKUP($E21,Inscrip!$A$2:$I$88,4)","v":"MPG"},{"$f":"VLOOKUP($E21,Inscrip!$A$2:$I$88,5)","v":"Loupian tri Nature (NL)"},718,15.25,18]
[{"$f":"VLOOKUP($E22,Inscrip!$A$2:$I$88,2)","v":"Bernard"},{"$f":"VLOOKUP($E22,Inscrip!$A$2:$I$88,3)","v":"Ilian"},{"$f":"VLOOKUP($E22,Inscrip!$A$2:$I$88,4)","v":"PG"},{"$f":"VLOOKUP($E22,Inscrip!$A$2:$I$88,5)","v":"NL"},710,15.28,19]
[{"$f":"VLOOKUP($E23,Inscrip!$A$2:$I$88,2)","v":"GUERIN"},{"$f":"VLOOKUP($E23,Inscrip!$A$2:$I$88,3)","v":"Leni"},{"$f":"VLOOKUP($E23,Inscrip!$A$2:$I$88,4)","v":"PG"},{"$f":"VLOOKUP($E23,Inscrip!$A$2:$I$88,5)","v":0},725,15.29,20]
[{"$f":"VLOOKUP($E24,Inscrip!$A$2:$I$88,2)","v":"ANGUERA Julian"},{"$f":"VLOOKUP($E24,Inscrip!$A$2:$I$88,3)","v":"Lilian "},{"$f":"VLOOKUP($E24,Inscrip!$A$2:$I$88,4)","v":"PG"},{"$f":"VLOOKUP($E24,Inscrip!$A$2:$I$88,5)","v":0},721,15.3,21]
[{"$f":"VLOOKUP($E25,Inscrip!$A$2:$I$88,2)","v":"ANDREO"},{"$f":"VLOOKUP($E25,Inscrip!$A$2:$I$88,3)","v":"Joris"},{"$f":"VLOOKUP($E25,Inscrip!$A$2:$I$88,4)","v":"MPG"},{"$f":"VLOOKUP($E25,Inscrip!$A$2:$I$88,5)","v":"Mèze"},726,15.31,22]
[{"$f":"VLOOKUP($E26,Inscrip!$A$2:$I$88,2)","v":"Weislo"},{"$f":"VLOOKUP($E26,Inscrip!$A$2:$I$88,3)","v":"Yoan"},{"$f":"VLOOKUP($E26,Inscrip!$A$2:$I$88,4)","v":"MPG"},{"$f":"VLOOKUP($E26,Inscrip!$A$2:$I$88,5)","v":"NL"},712,15.48,23]
[{"$f":"VLOOKUP($E27,Inscrip!$A$2:$I$88,2)","v":"GUERIN"},{"$f":"VLOOKUP($E27,Inscrip!$A$2:$I$88,3)","v":"Lia"},{"$f":"VLOOKUP($E27,Inscrip!$A$2:$I$88,4)","v":"PF"},{"$f":"VLOOKUP($E27,Inscrip!$A$2:$I$88,5)","v":0},724,15.49,24]
[{"$f":"VLOOKUP($E28,Inscrip!$A$2:$I$88,2)","v":"Bernard"},{"$f":"VLOOKUP($E28,Inscrip!$A$2:$I$88,3)","v":"Camille"},{"$f":"VLOOKUP($E28,Inscrip!$A$2:$I$88,4)","v":"PuF"},{"$f":"VLOOKUP($E28,Inscrip!$A$2:$I$88,5)","v":"NL"},709,16.260000000000002,25]
[{"$f":"VLOOKUP($E29,Inscrip!$A$2:$I$88,2)","v":"COUTURIER "},{"$f":"VLOOKUP($E29,Inscrip!$A$2:$I$88,3)","v":"Esteban"},{"$f":"VLOOKUP($E29,Inscrip!$A$2:$I$88,4)","v":"PG"},{"$f":"VLOOKUP($E29,Inscrip!$A$2:$I$88,5)","v":0},702,16.32,26]
[{"$f":"VLOOKUP($E30,Inscrip!$A$2:$I$88,2)","v":"Courbard"},{"$f":"VLOOKUP($E30,Inscrip!$A$2:$I$88,3)","v":"Anna"},{"$f":"VLOOKUP($E30,Inscrip!$A$2:$I$88,4)","v":"PuF"},{"$f":"VLOOKUP($E30,Inscrip!$A$2:$I$88,5)","v":"Loupian tri Nature"},703,16.57,27]
[{"$f":"VLOOKUP($E31,Inscrip!$A$2:$I$88,2)","v":"DUPIN"},{"$f":"VLOOKUP($E31,Inscrip!$A$2:$I$88,3)","v":" Noah"},{"$f":"VLOOKUP($E31,Inscrip!$A$2:$I$88,4)","v":"PG"},{"$f":"VLOOKUP($E31,Inscrip!$A$2:$I$88,5)","v":"NL"},720,17.04,28]
[{"$f":"VLOOKUP($E32,Inscrip!$A$2:$I$88,2)","v":"Salamé"},{"$f":"VLOOKUP($E32,Inscrip!$A$2:$I$88,3)","v":"Teva"},{"$f":"VLOOKUP($E32,Inscrip!$A$2:$I$88,4)","v":"MPG"},{"$f":"VLOOKUP($E32,Inscrip!$A$2:$I$88,5)","v":"NL"},719,17.07,29]
[{"$f":"VLOOKUP($E33,Inscrip!$A$2:$I$88,2)","v":"Martinez"},{"$f":"VLOOKUP($E33,Inscrip!$A$2:$I$88,3)","v":"Lucie"},{"$f":"VLOOKUP($E33,Inscrip!$A$2:$I$88,4)","v":"PuF"},{"$f":"VLOOKUP($E33,Inscrip!$A$2:$I$88,5)","v":"Loupian tri Nature"},707,18.14,30]

{"sheet":"Inscrip","index":2,"n_rows":32,"n_cols":13,"rows_kept":32,"cut":false,"hidden":false,"merged":[]}
["Dossard","Nom","Prénom","Cat","Club","AP","Pass","Certificat","Ville "]
[700,"Arcella ","Pierre","MPG","Loupian tri Nature","X","Lic","X","Marseillan"]
[701,"Bauby","Thomas","PuG","Loupian tri Nature (NL)","X",null,"X","Loupian"]
[702,"COUTURIER ","Esteban","PG",null,"X","X","X"," "]
[703,"Courbard","Anna","PuF","Loupian tri Nature","X","Lic","X","Gigean"]
[704,"Egiziano","Loane","PuF","Loupian tri Nature","X","Lic","X","Meze"]
[705,"Fonta","Pauline","PuF","Loupian tri Nature","X","Lic","X","Villeveyrac"]
[706,"Moulin","Martial","MPG","NL","X",null,"X","Saint Bauzille de la sylve"]
[707,"Martinez","Lucie","PuF","Loupian tri Nature","X","Lic","X","Loupian"]
[708,"Ribeiro-Patrao","Anthony","PuG","Loupian tri Nature","X","Lic","X","Meze"]
[709,"Bernard","Camille","PuF","NL","X",null,"X","Le Crès"]
[710,"Bernard","Ilian","PG","NL","X",null,"X","Le Crès"]
[711,"Blot","Titouan","PuG","NL","X","X","X","Le Crès",null,null,null,","]
[712,"Weislo","Yoan","MPG","NL","X",null,"X","Frontignan"]
[713,"Rue","Tom","PuG","NL","X",null,"X","Mudaison"]
[714,"Rue","Loan","MPG","NL","X",null,"X","Mudaison"]
[715,"Chabert","Claire","PuF","BCAM (NL)","X","X","X"]
[716]
[717,"Besalduch","Baptiste","PuG","BCAM(NL)","X",null,"X","Béziers"]
[718,"Brieu","Nino","MPG","Loupian tri Nature (NL)","X","X","X","Meze"]
[719,"Salamé","Teva","MPG","NL","X",null,"X","Pezenas"]
[720,"DUPIN"," Noah","PG","NL","X",null,null,"Montpellier"]
[721,"ANGUERA Julian","Lilian ","PG",null,"X","X","X"]
[722,"Martinez","Margaux","PF","BCAM","X","X","X"," "]
[723,"FAJARDO","Lucas","PG","VTThau","  ","X","X"]
[724,"GUERIN","Lia","PF",null,"X",null,"X"]
[725,"GUERIN","Leni","PG",null,"X",null,"X"]
[726,"ANDREO","Joris","MPG","Mèze","X","X","X"]
[727,"PAUL ","Ronan","PG",null,"X","X","X"]
[728,"MOURGUES ","Pierre","PG",null,"X","X"," "]
[729,"REGNIER","Leo","MG",null,"X","X"," "]
[730,"FEBRER ","Vincent","PG","GNT","X","X","X","Narbonne"]

{"sheet":"Feuil1","index":3,"n_rows":0,"n_cols":0,"rows_kept":0,"cut":false,"hidden":false,"merged":[]}